Reaction Details
TargetGlutamate receptor ionotropic, NMDA 2B
LigandBDBM50124908
Substrate/Competitorn/a
Meas. Tech.ChEMBL_1288251 (CHEMBL3117325)
Ki 2.1±n/a nM
Citation Beinat, CBanister, SDHoban, JTsanaktsidis, JMetaxas, AWindhorst, ADKassiou, M Structure-activity relationships of N-substituted 4-(trifluoromethoxy)benzamidines with affinity for GluN2B-containing NMDA receptors. Bioorg Med Chem Lett24:828-30 (2014) 
 
Glutamate receptor ionotropic, NMDA 2B
Name:Glutamate receptor ionotropic, NMDA 2B
Type:Protein
Mol. Mass.:166077.66
Organism:Rattus norvegicus (Rat)
Description:Q00960
Residue:1482
BDBM50124908
NameBDBM50124908
Synonyms:CHEMBL159560 | N-(2-Methoxy-benzyl)-4-trifluoromethoxy-benzamidine
TypeSmall organic molecule
Emp. Form.C16H15F3N2O2
Mol. Mass.324.2977
SMILESCOc1ccccc1CN=C(N)c1ccc(OC(F)(F)F)cc1