Reaction Details
TargetAlkaline phosphatase, tissue-nonspecific isozyme
LigandBDBM50447413
Substrate/Competitorn/a
Meas. Tech.ChEMBL_1288275 (CHEMBL3117558)
IC50 35000±n/a nM
Citation Ardecky, RJBobkova, EVKiffer-Moreira, TBrown, BGanji, SZou, JPass, INarisawa, SIano, FGRosenstein, CCheltsov, ARascon, JHedrick, MGasior, CForster, AShi, SDahl, RVasile, SSu, YSergienko, EChung, TDKaunitz, JHoylaerts, MFPinkerton, ABMillán, JL Identification of a selective inhibitor of murine intestinal alkaline phosphatase (ML260) by concurrent ultra-high throughput screening against human and mouse isozymes. Bioorg Med Chem Lett24:1000-4 (2014) 
 
Alkaline phosphatase, tissue-nonspecific isozyme
Name:Alkaline phosphatase, tissue-nonspecific isozyme
Type:PROTEIN
Mol. Mass.:57306.17
Organism:Homo sapiens (Human)
Description:ChEMBL_1448917
Residue:524
BDBM50447413
NameBDBM50447413
Synonyms:CHEMBL3115157
TypeSmall organic molecule
Emp. Form.C17H17N3O5S
Mol. Mass.375.399
SMILESCc1ccc(C)c(NC(=O)CNS(=O)(=O)c2ccc3[nH]c(=O)oc3c2)c1