Reaction Details
TargetCyclin-A2/Cyclin-dependent kinase 2
LigandBDBM6309
Substrate/Competitorn/a
Meas. Tech.ChEMBL_1289040 (CHEMBL3118104)
IC50 230±n/a nM
Citation Reddy, MVAkula, BCosenza, SCAthuluridivakar, SMallireddigari, MRPallela, VRBilla, VKSubbaiah, DRBharathi, EVVasquez-Del Carpio, RPadgaonkar, ABaker, SJReddy, EP Discovery of 8-cyclopentyl-2-[4-(4-methyl-piperazin-1-yl)-phenylamino]-7-oxo-7,8-dihydro-pyrido[2,3-d]pyrimidine-6-carbonitrile (7x) as a potent inhibitor of cyclin-dependent kinase 4 (CDK4) and AMPK-related kinase 5 (ARK5). J Med Chem57:578-99 (2014) 
 
Cyclin-A2/Cyclin-dependent kinase 2
Name:Cyclin-A2/Cyclin-dependent kinase 2
Type:Protein Complex
Mol. Mass.:n/a
Description:Cdk2/Cyclin A kinase was purified from insect cells coinfected with Cyclin A/Cdk2 baculovirus.
Components:This complex has 2 components.
Component 1
Name:Cyclin-dependent kinase 2
Synonyms:CDK2 CDK2_HUMAN Cell division protein kinase 2 Protein cereblon/Cyclin-dependent kinase 2 | p33 protein kinase
Type:Enzyme Subunit
Mol. Mass.:33938.17
Organism:Homo sapiens (Human)
Description:P24941
Residue:298
Component 2
Name:Cyclin-A2
Synonyms:CCN1 CCNA1 CCNA2_HUMAN Cyclin-A
Type:Enzyme Subunit
Mol. Mass.:48550.19
Organism:Homo sapiens (Human)
Description:P20248
Residue:432
BDBM6309
NameBDBM6309
Synonyms:6-Acetyl-8-cyclopentyl-5-methyl-2-(5-piperazin-1-yl-pyridin-2-ylamino)-8H-pyrido[2,3-d]pyrimidin-7-one Hydrochloride Ibrance Palbociclib US10189849, PD0332991 US10626107, Example Palbociclib US10927120, PD0332991 US9957276, PD0332991
TypeSmall organic molecule
Emp. Form.C24H29N7O2
Mol. Mass.447.5328
SMILESCC(=O)c1c(C)c2cnc(Nc3ccc(cn3)N3CCNCC3)nc2n(C2CCCC2)c1=O