Reaction Details
TargetTyrosine-protein kinase ABL1
LigandBDBM50447512
Substrate/Competitorn/a
Meas. Tech.ChEMBL_1288868 (CHEMBL3117353)
IC50 53±n/a nM
Citation Reddy, MVAkula, BCosenza, SCAthuluridivakar, SMallireddigari, MRPallela, VRBilla, VKSubbaiah, DRBharathi, EVVasquez-Del Carpio, RPadgaonkar, ABaker, SJReddy, EP Discovery of 8-cyclopentyl-2-[4-(4-methyl-piperazin-1-yl)-phenylamino]-7-oxo-7,8-dihydro-pyrido[2,3-d]pyrimidine-6-carbonitrile (7x) as a potent inhibitor of cyclin-dependent kinase 4 (CDK4) and AMPK-related kinase 5 (ARK5). J Med Chem57:578-99 (2014) 
 
Tyrosine-protein kinase ABL1
Name:Tyrosine-protein kinase ABL1
Type:Enzyme
Mol. Mass.:122897.30
Organism:Homo sapiens (Human)
Description:P00519
Residue:1130
BDBM50447512
NameBDBM50447512
Synonyms:CHEMBL3115681
TypeSmall organic molecule
Emp. Form.C24H27N7O
Mol. Mass.429.5175
SMILESCN1CCN(CC1)c1ccc(Nc2ncc3cc(C#N)c(=O)n(C4CCCC4)c3n2)cc1