Reaction Details
TargetCoagulation factor XI
LigandBDBM50447514
Substrate/Competitorn/a
Meas. Tech.ChEMBL_1289209 (CHEMBL3119476)
IC50 43000±n/a nM
Citation Bach, PKnerr, LFjellström, OHansson, KMattsson, CGustafsson, D Design, synthesis, and SAR of a series of activated protein C (APC) inhibitors with selectivity against thrombin for the treatment of haemophilia. Bioorg Med Chem Lett24:821-7 (2014) 
 
Coagulation factor XI
Name:Coagulation factor XI
Type:Enzyme
Mol. Mass.:70130.58
Organism:Homo sapiens (Human)
Description:P03951
Residue:625
BDBM50447514
NameBDBM50447514
Synonyms:CHEMBL3115903
TypeSmall organic molecule
Emp. Form.C29H40N6O4
Mol. Mass.536.6657
SMILESNCc1ccc(CC(NC(=O)[C@@H](CC2CCCCC2)NCC(O)=O)C(=O)NCc2ccc(cc2)C(N)=N)cc1