Reaction Details
TargetCoagulation factor XI
LigandBDBM50447519
Substrate/Competitorn/a
Meas. Tech.ChEMBL_1289209 (CHEMBL3119476)
IC50>44000±n/a nM
Citation Bach, PKnerr, LFjellström, OHansson, KMattsson, CGustafsson, D Design, synthesis, and SAR of a series of activated protein C (APC) inhibitors with selectivity against thrombin for the treatment of haemophilia. Bioorg Med Chem Lett24:821-7 (2014) 
 
Coagulation factor XI
Name:Coagulation factor XI
Type:Enzyme
Mol. Mass.:70130.58
Organism:Homo sapiens (Human)
Description:P03951
Residue:625
BDBM50447519
NameBDBM50447519
Synonyms:CHEMBL3115906
TypeSmall organic molecule
Emp. Form.C26H42N8O4
Mol. Mass.530.6629
SMILES[#7]\[#6](-[#7])=[#7]\[#6]-[#6]-[#6]-[#6@H](-[#7]-[#6](=O)-[#6@@H](-[#6]-[#6]-1-[#6]-[#6]-[#6]-[#6]-[#6]-1)-[#7]-[#6]-[#6]-[#6](-[#8])=O)-[#6](=O)-[#7]-[#6]-c1ccc(cc1)-[#6](-[#7])=[#7]