Reaction Details
TargetVitamin K-dependent protein C
LigandBDBM50447522
Substrate/Competitorn/a
Meas. Tech.ChEMBL_1289202 (CHEMBL3119469)
Ki 300±n/a nM
Citation Bach, PKnerr, LFjellström, OHansson, KMattsson, CGustafsson, D Design, synthesis, and SAR of a series of activated protein C (APC) inhibitors with selectivity against thrombin for the treatment of haemophilia. Bioorg Med Chem Lett24:821-7 (2014) 
 
Vitamin K-dependent protein C
Name:Vitamin K-dependent protein C
Type:Enzyme
Mol. Mass.:52067.73
Organism:Homo sapiens (Human)
Description:n/a
Residue:461
BDBM50447522
NameBDBM50447522
Synonyms:CHEMBL3115898
TypeSmall organic molecule
Emp. Form.C32H39N5O4
Mol. Mass.557.6832
SMILESNC(=N)c1ccc(CNC(=O)[C@H](Cc2cccc3ccccc23)NC(=O)[C@@H](CC2CCCCC2)NCC(O)=O)cc1