Reaction Details
TargetVitamin K-dependent protein C
LigandBDBM50447524
Substrate/Competitorn/a
Meas. Tech.ChEMBL_1289202 (CHEMBL3119469)
Ki 900±n/a nM
Citation Bach, PKnerr, LFjellström, OHansson, KMattsson, CGustafsson, D Design, synthesis, and SAR of a series of activated protein C (APC) inhibitors with selectivity against thrombin for the treatment of haemophilia. Bioorg Med Chem Lett24:821-7 (2014) 
 
Vitamin K-dependent protein C
Name:Vitamin K-dependent protein C
Type:Enzyme
Mol. Mass.:52067.73
Organism:Homo sapiens (Human)
Description:n/a
Residue:461
BDBM50447524
NameBDBM50447524
Synonyms:CHEMBL3115896
TypeSmall organic molecule
Emp. Form.C26H42N6O2
Mol. Mass.470.6507
SMILESN[C@H](CC1CCCCC1)C(=O)NC(CCC1CCNCC1)C(=O)NCc1ccc(cc1)C(N)=N