Reaction Details
TargetVitamin K-dependent protein C
LigandBDBM50447518
Substrate/Competitorn/a
Meas. Tech.ChEMBL_1289213 (CHEMBL3119480)
IC50 3100±n/a nM
Citation Bach, PKnerr, LFjellström, OHansson, KMattsson, CGustafsson, D Design, synthesis, and SAR of a series of activated protein C (APC) inhibitors with selectivity against thrombin for the treatment of haemophilia. Bioorg Med Chem Lett24:821-7 (2014) 
 
Vitamin K-dependent protein C
Name:Vitamin K-dependent protein C
Type:Enzyme
Mol. Mass.:52067.73
Organism:Homo sapiens (Human)
Description:n/a
Residue:461
BDBM50447518
NameBDBM50447518
Synonyms:CHEMBL3115892
TypeSmall organic molecule
Emp. Form.C26H40N6O4
Mol. Mass.500.6336
SMILESNC(=N)c1ccc(CNC(=O)[C@@H](NC(=O)[C@@H](CC2CCCCC2)NCC(O)=O)C2CCNCC2)cc1