Reaction Details
TargetOxa40
LigandBDBM50447647
Substrate/Competitorn/a
Meas. Tech.ChEMBL_1289443 (CHEMBL3117137)
IC50 28000±n/a nM
Citation Blizzard, TAChen, HKim, SWu, JBodner, RGude, CImbriglio, JYoung, KPark, YWOgawa, ARaghoobar, SHairston, NPainter, REWisniewski, DScapin, GFitzgerald, PSharma, NLu, JHa, SHermes, JHammond, ML Discovery of MK-7655, aß-lactamase inhibitor for combination with Primaxin®. Bioorg Med Chem Lett24:780-5 (2014) 
 
Oxa40
Name:Oxa40
Type:Enzyme
Mol. Mass.:30946.50
Organism:Acinetobacter baumannii
Description:Q8RLA6
Residue:275
BDBM50447647
NameBDBM50447647
Synonyms:CHEMBL3112752
TypeSmall organic molecule
Emp. Form.C16H20N4O8S
Mol. Mass.428.417
SMILESN[C@@H](Cc1ccc(NC(=O)[C@@H]2CC[C@@H]3CN2C(=O)N3OS(O)(=O)=O)cc1)C(O)=O