Reaction Details
TargetFatty-acid amide hydrolase 1 [30-579]
LigandBDBM50447745
Substrate/Competitorn/a
Meas. Tech.ChEMBL_1290134 (CHEMBL3117474)
IC50 0.340000±n/a nM
Citation Kono, MMatsumoto, TImaeda, TKawamura, TFujimoto, SKosugi, YOdani, TShimizu, YMatsui, HShimojo, MKori, M Design, synthesis, and biological evaluation of a series of piperazine ureas as fatty acid amide hydrolase inhibitors. Bioorg Med Chem22:1468-78 (2014) 
 
Fatty-acid amide hydrolase 1 [30-579]
Name:Fatty-acid amide hydrolase 1 [30-579]
Type:Single-pass membrane protein; homodimer
Mol. Mass.:60474.00
Organism:Rattus norvegicus (rat)
Description:P97612 (aa 30-579)
Residue:550
BDBM50447745
NameBDBM50447745
Synonyms:CHEMBL3113274
TypeSmall organic molecule
Emp. Form.C19H17F2N7O
Mol. Mass.397.3814
SMILESFc1cc(F)cc(c1)-c1ccnc(n1)N1CCN(CC1)C(=O)Nc1cccnn1