Reaction Details
TargetFatty-acid amide hydrolase 1
LigandBDBM50447749
Substrate/Competitorn/a
Meas. Tech.ChEMBL_1290137 (CHEMBL3117477)
IC50 1.1±n/a nM
Citation Kono, MMatsumoto, TImaeda, TKawamura, TFujimoto, SKosugi, YOdani, TShimizu, YMatsui, HShimojo, MKori, M Design, synthesis, and biological evaluation of a series of piperazine ureas as fatty acid amide hydrolase inhibitors. Bioorg Med Chem22:1468-78 (2014) 
 
Fatty-acid amide hydrolase 1
Name:Fatty-acid amide hydrolase 1
Type:Protein
Mol. Mass.:63071.19
Organism:Homo sapiens (Human)
Description:O00519
Residue:579
BDBM50447749
NameBDBM50447749
Synonyms:CHEMBL3113270
TypeSmall organic molecule
Emp. Form.C19H17F2N7O
Mol. Mass.397.3814
SMILESFc1ccc(c(F)c1)-c1ccnc(n1)N1CCN(CC1)C(=O)Nc1cccnn1