Reaction Details
TargetProtein-arginine deiminase type-4
LigandBDBM50447757
Substrate/Competitorn/a
Meas. Tech.ChEMBL_1290371 (CHEMBL3119086)
Ki 20100±n/a nM
Citation Dreyton, CJAnderson, EDSubramanian, VBoger, DLThompson, PR Insights into the mechanism of streptonigrin-induced protein arginine deiminase inactivation. Bioorg Med Chem22:1362-9 (2014) 
 
Protein-arginine deiminase type-4
Name:Protein-arginine deiminase type-4
Type:Enzyme Catalytic Domain
Mol. Mass.:74078.90
Organism:Homo sapiens (Human)
Description:gi_216548487
Residue:663
BDBM50447757
NameBDBM50447757
Synonyms:CHEMBL57818
TypeSmall organic molecule
Emp. Form.C14H9N3O2
Mol. Mass.251.2402
SMILESNC1=CC(=O)c2ccc(nc2C1=O)-c1ccccn1