Reaction Details
TargetProtein-arginine deiminase type-4
LigandBDBM50447758
Substrate/Competitorn/a
Meas. Tech.ChEMBL_1290377 (CHEMBL3119092)
IC50 2500±n/a nM
Citation Dreyton, CJAnderson, EDSubramanian, VBoger, DLThompson, PR Insights into the mechanism of streptonigrin-induced protein arginine deiminase inactivation. Bioorg Med Chem22:1362-9 (2014) 
 
Protein-arginine deiminase type-4
Name:Protein-arginine deiminase type-4
Type:Enzyme Catalytic Domain
Mol. Mass.:74078.90
Organism:Homo sapiens (Human)
Description:gi_216548487
Residue:663
BDBM50447758
NameBDBM50447758
Synonyms:CHEBI:9287 Nigrin Streptonigrin
TypeSmall organic molecule
Emp. Form.C25H22N4O8
Mol. Mass.506.4642
SMILESCOC1=C(N)C(=O)c2nc(ccc2C1=O)-c1nc(C(O)=O)c(C)c(c1N)-c1ccc(OC)c(OC)c1O