Reaction Details
TargetProtein-arginine deiminase type-4
LigandBDBM50447760
Substrate/Competitorn/a
Meas. Tech.ChEMBL_1290377 (CHEMBL3119092)
IC50 240±n/a nM
Citation Dreyton, CJAnderson, EDSubramanian, VBoger, DLThompson, PR Insights into the mechanism of streptonigrin-induced protein arginine deiminase inactivation. Bioorg Med Chem22:1362-9 (2014) 
 
Protein-arginine deiminase type-4
Name:Protein-arginine deiminase type-4
Type:Enzyme Catalytic Domain
Mol. Mass.:74078.90
Organism:Homo sapiens (Human)
Description:gi_216548487
Residue:663
BDBM50447760
NameBDBM50447760
Synonyms:CHEMBL58150
TypeSmall organic molecule
Emp. Form.C15H9N3O4
Mol. Mass.295.2497
SMILESNC1=CC(=O)c2ccc(nc2C1=O)-c1cccc(n1)C(O)=O