Reaction Details
TargetProtein-arginine deiminase type-2
LigandBDBM50447759
Substrate/Competitorn/a
Meas. Tech.ChEMBL_1290379 (CHEMBL3119094)
IC50 1550±n/a nM
Citation Dreyton, CJAnderson, EDSubramanian, VBoger, DLThompson, PR Insights into the mechanism of streptonigrin-induced protein arginine deiminase inactivation. Bioorg Med Chem22:1362-9 (2014) 
 
Protein-arginine deiminase type-2
Name:Protein-arginine deiminase type-2
Type:PROTEIN
Mol. Mass.:75552.49
Organism:Homo sapiens (Human)
Description:ChEMBL_1290379
Residue:665
BDBM50447759
NameBDBM50447759
Synonyms:CHEMBL3113470
TypeSmall organic molecule
Emp. Form.C9H5BrN2O2
Mol. Mass.253.052
SMILESNC1=C(Br)C(=O)c2cccnc2C1=O