Reaction Details
TargetProtein-arginine deiminase type-2
LigandBDBM50447760
Substrate/Competitorn/a
Meas. Tech.ChEMBL_1290379 (CHEMBL3119094)
IC50 200±n/a nM
Citation Dreyton, CJAnderson, EDSubramanian, VBoger, DLThompson, PR Insights into the mechanism of streptonigrin-induced protein arginine deiminase inactivation. Bioorg Med Chem22:1362-9 (2014) 
 
Protein-arginine deiminase type-2
Name:Protein-arginine deiminase type-2
Type:PROTEIN
Mol. Mass.:75552.49
Organism:Homo sapiens (Human)
Description:ChEMBL_1290379
Residue:665
BDBM50447760
NameBDBM50447760
Synonyms:CHEMBL58150
TypeSmall organic molecule
Emp. Form.C15H9N3O4
Mol. Mass.295.2497
SMILESNC1=CC(=O)c2ccc(nc2C1=O)-c1cccc(n1)C(O)=O