Reaction Details
TargetProtein-arginine deiminase type-2
LigandBDBM80075
Substrate/Competitorn/a
Meas. Tech.ChEMBL_1290379 (CHEMBL3119094)
IC50 6320±n/a nM
Citation Dreyton, CJAnderson, EDSubramanian, VBoger, DLThompson, PR Insights into the mechanism of streptonigrin-induced protein arginine deiminase inactivation. Bioorg Med Chem22:1362-9 (2014) 
 
Protein-arginine deiminase type-2
Name:Protein-arginine deiminase type-2
Type:PROTEIN
Mol. Mass.:75552.49
Organism:Homo sapiens (Human)
Description:ChEMBL_1290379
Residue:665
BDBM80075
NameBDBM80075
Synonyms:7-bromanyl-6-methoxy-quinoline-5,8-dione 7-bromo-6-methoxyquinoline-5,8-dione SMR001570458 | cid_265935
TypeSmall organic molecule
Emp. Form.C10H6BrNO3
Mol. Mass.268.064
SMILESCOC1=C(Br)C(=O)c2ncccc2C1=O