Reaction Details
TargetRetinoic acid receptor alpha
LigandBDBM50244760
Substrate/Competitorn/a
Meas. Tech.ChEMBL_1290847 (CHEMBL3118432)
IC50 4474±n/a nM
Citation García-Rodríguez, JPérez-Rodríguez, SOrtiz, MAPereira, Rde Lera, ARPiedrafita, FJ Inhibition of I¿B kinase-ß and I¿B kinase-a by heterocyclic adamantyl arotinoids. Bioorg Med Chem22:1285-302 (2014) 
 
Retinoic acid receptor alpha
Name:Retinoic acid receptor alpha
Type:PROTEIN
Mol. Mass.:50778.87
Organism:Homo sapiens (Human)
Description:ChEMBL_1466191
Residue:462
BDBM50244760
NameBDBM50244760
Synonyms:(E)-4-{3-[3-Adamantan-1-yl-4-(2-methoxy-ethoxymethoxy)-phenyl]-3-oxo-propenyl}-benzoic acid CHEMBL462134
TypeSmall organic molecule
Emp. Form.C30H34O6
Mol. Mass.490.5874
SMILESCOCCOCOc1ccc(cc1C12CC3CC(CC(C3)C1)C2)C(=O)\C=C\c1ccc(cc1)C(O)=O