Reaction Details
TargetRetinoic acid receptor alpha
LigandBDBM50447838
Substrate/Competitorn/a
Meas. Tech.ChEMBL_1290847 (CHEMBL3118432)
IC50 2650±n/a nM
Citation García-Rodríguez, JPérez-Rodríguez, SOrtiz, MAPereira, Rde Lera, ARPiedrafita, FJ Inhibition of I¿B kinase-ß and I¿B kinase-a by heterocyclic adamantyl arotinoids. Bioorg Med Chem22:1285-302 (2014) 
 
Retinoic acid receptor alpha
Name:Retinoic acid receptor alpha
Type:PROTEIN
Mol. Mass.:50778.87
Organism:Homo sapiens (Human)
Description:ChEMBL_1466191
Residue:462
BDBM50447838
NameBDBM50447838
Synonyms:CHEMBL3114296
TypeSmall organic molecule
Emp. Form.C26H25NO3S
Mol. Mass.431.547
SMILESOC(=O)c1ccc(cc1)-c1cnc(s1)-c1ccc(O)c(c1)C12CC3CC(CC(C3)C1)C2