Reaction Details
TargetSucrase-isomaltase, intestinal
LigandBDBM50447854
Substrate/Competitorn/a
Meas. Tech.ChEMBL_1288549 (CHEMBL3118982)
IC50>1000000±n/a nM
Citation Thao, NPLuyen, BTTai, BHYang, SYJo, SHCuong, NXNam, NHKwon, YIMinh, CVKim, YH Rat intestinal sucrase inhibition of constituents from the roots of Rosa rugosa Thunb. Bioorg Med Chem Lett24:1192-6 (2014) 
 
Sucrase-isomaltase, intestinal
Name:Sucrase-isomaltase, intestinal
Type:Enzyme
Mol. Mass.:210329.04
Organism:Rattus norvegicus (Rat)
Description:P23739
Residue:1841
BDBM50447854
NameBDBM50447854
Synonyms:CHEMBL3114753 | CHEMBL3114754
TypeSmall organic molecule
Emp. Form.C19H30O7
Mol. Mass.370.4373
SMILESCC(CC=C1C(C)=CC(=O)CC1(C)C)O[C@@H]1O[C@H](CO)[C@@H](O)[C@H](O)[C@H]1O