Reaction Details
TargetSucrase-isomaltase, intestinal
LigandBDBM50447858
Substrate/Competitorn/a
Meas. Tech.ChEMBL_1288549 (CHEMBL3118982)
IC50 430000±n/a nM
Citation Thao, NPLuyen, BTTai, BHYang, SYJo, SHCuong, NXNam, NHKwon, YIMinh, CVKim, YH Rat intestinal sucrase inhibition of constituents from the roots of Rosa rugosa Thunb. Bioorg Med Chem Lett24:1192-6 (2014) 
 
Sucrase-isomaltase, intestinal
Name:Sucrase-isomaltase, intestinal
Type:Enzyme
Mol. Mass.:210329.04
Organism:Rattus norvegicus (Rat)
Description:P23739
Residue:1841
BDBM50447858
NameBDBM50447858
Synonyms:CHEBI:75630 | CHEMBL501490
TypeSmall organic molecule
Emp. Form.C30H26O12
Mol. Mass.578.5202
SMILESO[C@H]1Cc2c(O)cc(O)c([C@H]3[C@H](O)[C@H](Oc4cc(O)cc(O)c34)c3ccc(O)c(O)c3)c2O[C@@H]1c1ccc(O)c(O)c1