Reaction Details
TargetSucrase-isomaltase, intestinal
LigandBDBM50447860
Substrate/Competitorn/a
Meas. Tech.ChEMBL_1288549 (CHEMBL3118982)
IC50 250000±n/a nM
Citation Thao, NPLuyen, BTTai, BHYang, SYJo, SHCuong, NXNam, NHKwon, YIMinh, CVKim, YH Rat intestinal sucrase inhibition of constituents from the roots of Rosa rugosa Thunb. Bioorg Med Chem Lett24:1192-6 (2014) 
 
Sucrase-isomaltase, intestinal
Name:Sucrase-isomaltase, intestinal
Type:Enzyme
Mol. Mass.:210329.04
Organism:Rattus norvegicus (Rat)
Description:P23739
Residue:1841
BDBM50447860
NameBDBM50447860
Synonyms:CHEMBL3114757
TypeSmall organic molecule
Emp. Form.C30H26O10
Mol. Mass.546.5214
SMILESO[C@@H]1Cc2c(O)cc(O)c([C@@H]3[C@@H](O)[C@@H](Oc4cc(O)ccc34)c3ccc(O)cc3)c2O[C@@H]1c1ccc(O)c(O)c1