Reaction Details
TargetSucrase-isomaltase, intestinal
LigandBDBM50447861
Substrate/Competitorn/a
Meas. Tech.ChEMBL_1288549 (CHEMBL3118982)
IC50>1000000±n/a nM
Citation Thao, NPLuyen, BTTai, BHYang, SYJo, SHCuong, NXNam, NHKwon, YIMinh, CVKim, YH Rat intestinal sucrase inhibition of constituents from the roots of Rosa rugosa Thunb. Bioorg Med Chem Lett24:1192-6 (2014) 
 
Sucrase-isomaltase, intestinal
Name:Sucrase-isomaltase, intestinal
Type:Enzyme
Mol. Mass.:210329.04
Organism:Rattus norvegicus (Rat)
Description:P23739
Residue:1841
BDBM50447861
NameBDBM50447861
Synonyms:CHEMBL3114759
TypeSmall organic molecule
Emp. Form.C30H44O4
Mol. Mass.468.668
SMILESCC1(C)C=C(C=O)[C@@]2(C)[C@H]1CC[C@]1(C)[C@@H]2CC=C2[C@@H]3[C@H](O)C(C)(C)CC[C@@]3(CC[C@@]12C)C(O)=O