Reaction Details
TargetSucrase-isomaltase, intestinal
LigandBDBM50447862
Substrate/Competitorn/a
Meas. Tech.ChEMBL_1288549 (CHEMBL3118982)
IC50>1000000±n/a nM
Citation Thao, NPLuyen, BTTai, BHYang, SYJo, SHCuong, NXNam, NHKwon, YIMinh, CVKim, YH Rat intestinal sucrase inhibition of constituents from the roots of Rosa rugosa Thunb. Bioorg Med Chem Lett24:1192-6 (2014) 
 
Sucrase-isomaltase, intestinal
Name:Sucrase-isomaltase, intestinal
Type:Enzyme
Mol. Mass.:210329.04
Organism:Rattus norvegicus (Rat)
Description:P23739
Residue:1841
BDBM50447862
NameBDBM50447862
Synonyms:CHEMBL3114760
TypeSmall organic molecule
Emp. Form.C22H36O2
Mol. Mass.332.52
SMILESC[C@@]12[C@@H](O)C=C[C@H]1CC[C@@H]1[C@@]3(C)CC[C@H](O)C(C)(C)[C@@H]3CC[C@@]21C