Reaction Details
TargetAlpha-ketoglutarate-dependent dioxygenase alkB homolog 3
LigandBDBM50447942
Substrate/Competitorn/a
Meas. Tech.ChEMBL_1288598 (CHEMBL3119218)
IC50 810±n/a nM
Citation Nakao, SMabuchi, MShimizu, TItoh, YTakeuchi, YUeda, MMizuno, HShigi, NOhshio, IJinguji, KUeda, YYamamoto, MFurukawa, TAoki, STsujikawa, KTanaka, A Design and synthesis of prostate cancer antigen-1 (PCA-1/ALKBH3) inhibitors as anti-prostate cancer drugs. Bioorg Med Chem Lett24:1071-4 (2014) 
 
Alpha-ketoglutarate-dependent dioxygenase alkB homolog 3
Name:Alpha-ketoglutarate-dependent dioxygenase alkB homolog 3
Type:PROTEIN
Mol. Mass.:33382.86
Organism:Homo sapiens (Human)
Description:ChEMBL_108024
Residue:286
BDBM50447942
NameBDBM50447942
Synonyms:CHEMBL3115007
TypeSmall organic molecule
Emp. Form.C24H20N4O
Mol. Mass.380.4418
SMILESCc1[nH]n(-c2nc3cc(ccc3[nH]2)-c2ccccc2)c(=O)c1Cc1ccccc1