Reaction Details
TargetAlpha-ketoglutarate-dependent dioxygenase alkB homolog 3
LigandBDBM50447948
Substrate/Competitorn/a
Meas. Tech.ChEMBL_1288598 (CHEMBL3119218)
IC50 680±n/a nM
Citation Nakao, SMabuchi, MShimizu, TItoh, YTakeuchi, YUeda, MMizuno, HShigi, NOhshio, IJinguji, KUeda, YYamamoto, MFurukawa, TAoki, STsujikawa, KTanaka, A Design and synthesis of prostate cancer antigen-1 (PCA-1/ALKBH3) inhibitors as anti-prostate cancer drugs. Bioorg Med Chem Lett24:1071-4 (2014) 
 
Alpha-ketoglutarate-dependent dioxygenase alkB homolog 3
Name:Alpha-ketoglutarate-dependent dioxygenase alkB homolog 3
Type:PROTEIN
Mol. Mass.:33382.86
Organism:Homo sapiens (Human)
Description:ChEMBL_108024
Residue:286
BDBM50447948
NameBDBM50447948
Synonyms:CHEMBL3115013
TypeSmall organic molecule
Emp. Form.C20H20N4O2
Mol. Mass.348.3984
SMILESCOc1ccc(Cc2c(C)[nH]n(-c3nc4ccc(C)cc4[nH]3)c2=O)cc1