Reaction Details
TargetAlpha-ketoglutarate-dependent dioxygenase alkB homolog 3
LigandBDBM50447951
Substrate/Competitorn/a
Meas. Tech.ChEMBL_1288598 (CHEMBL3119218)
IC50 630±n/a nM
Citation Nakao, SMabuchi, MShimizu, TItoh, YTakeuchi, YUeda, MMizuno, HShigi, NOhshio, IJinguji, KUeda, YYamamoto, MFurukawa, TAoki, STsujikawa, KTanaka, A Design and synthesis of prostate cancer antigen-1 (PCA-1/ALKBH3) inhibitors as anti-prostate cancer drugs. Bioorg Med Chem Lett24:1071-4 (2014) 
 
Alpha-ketoglutarate-dependent dioxygenase alkB homolog 3
Name:Alpha-ketoglutarate-dependent dioxygenase alkB homolog 3
Type:PROTEIN
Mol. Mass.:33382.86
Organism:Homo sapiens (Human)
Description:ChEMBL_108024
Residue:286
BDBM50447951
NameBDBM50447951
Synonyms:CHEMBL3114999
TypeSmall organic molecule
Emp. Form.C19H18N4O2
Mol. Mass.334.3718
SMILESCOc1ccc(Cc2c(C)[nH]n(-c3nc4ccccc4[nH]3)c2=O)cc1