Reaction Details
TargetPhosphatidylinositol 4-kinase alpha
LigandBDBM50448103
Substrate/Competitorn/a
Meas. Tech.ChEMBL_1292924 (CHEMBL3122829)
IC50 1.6±n/a nM
Citation Leivers, ALTallant, MShotwell, JBDickerson, SLeivers, MRMcDonald, OBGobel, JCreech, KLStrum, SLMathis, ARogers, SMoore, CBBotyanszki, J Discovery of selective small molecule type III phosphatidylinositol 4-kinase alpha (PI4KIIIa) inhibitors as anti hepatitis C (HCV) agents. J Med Chem57:2091-106 (2014) 
 
Phosphatidylinositol 4-kinase alpha
Name:Phosphatidylinositol 4-kinase alpha
Type:Protein
Mol. Mass.:231326.70
Organism:Homo sapiens (Human)
Description:P42356
Residue:2102
BDBM50448103
NameBDBM50448103
Synonyms:CHEMBL3121327
TypeSmall organic molecule
Emp. Form.C24H21F2N5O4S
Mol. Mass.513.516
SMILESCOc1ncc(cc1NS(=O)(=O)c1ccc(F)cc1F)-c1ccc2ncnc(N3CCOCC3)c2c1