Reaction Details
TargetPhosphatidylinositol 4,5-bisphosphate 3-kinase catalytic subunit gamma isoform
LigandBDBM50448086
Substrate/Competitorn/a
Meas. Tech.ChEMBL_1292919 (CHEMBL3122824)
IC50 50±n/a nM
Citation Leivers, ALTallant, MShotwell, JBDickerson, SLeivers, MRMcDonald, OBGobel, JCreech, KLStrum, SLMathis, ARogers, SMoore, CBBotyanszki, J Discovery of selective small molecule type III phosphatidylinositol 4-kinase alpha (PI4KIIIa) inhibitors as anti hepatitis C (HCV) agents. J Med Chem57:2091-106 (2014) 
 
Phosphatidylinositol 4,5-bisphosphate 3-kinase catalytic subunit gamma isoform
Name:Phosphatidylinositol 4,5-bisphosphate 3-kinase catalytic subunit gamma isoform
Type:Enzyme Subunit
Mol. Mass.:126470.30
Organism:Homo sapiens (Human)
Description:P48736
Residue:1102
BDBM50448086
NameBDBM50448086
Synonyms:CHEMBL3121322
TypeSmall organic molecule
Emp. Form.C27H20N6O4S
Mol. Mass.524.551
SMILESCOc1ncc(cc1NS(=O)(=O)c1ccc(cc1)C#N)-c1ccc2nc(N)n(-c3ccccc3)c(=O)c2c1