Reaction Details
TargetLeucine-rich repeat serine/threonine-protein kinase 2
LigandBDBM50448117
Substrate/Competitorn/a
Meas. Tech.ChEMBL_1291902 (CHEMBL3124216)
Ki 1.000000±n/a nM
Citation Estrada, AAChan, BKBaker-Glenn, CBeresford, ABurdick, DJChambers, MChen, HDominguez, SLDotson, JDrummond, JFlagella, MFuji, RGill, AHalladay, JHarris, SFHeffron, TPKleinheinz, TLee, DWLe Pichon, CELiu, XLyssikatos, JPMedhurst, ADMoffat, JGNash, KScearce-Levie, KSheng, ZShore, DGWong, SZhang, SZhang, XZhu, HSweeney, ZK Discovery of highly potent, selective, and brain-penetrant aminopyrazole leucine-rich repeat kinase 2 (LRRK2) small molecule inhibitors. J Med Chem57:921-36 (2014) 
 
Leucine-rich repeat serine/threonine-protein kinase 2
Name:Leucine-rich repeat serine/threonine-protein kinase 2
Type:Protein
Mol. Mass.:286113.20
Organism:Homo sapiens (Human)
Description:Q5S007
Residue:2527
BDBM50448117
NameBDBM50448117
Synonyms:CHEMBL3122114
TypeSmall organic molecule
Emp. Form.C14H16F3N7
Mol. Mass.339.3189
SMILESCNc1nc(Nc2cnn(c2C)C(C)(C)C#N)ncc1C(F)(F)F