Reaction Details
TargetLeucine-rich repeat serine/threonine-protein kinase 2
LigandBDBM50448125
Substrate/Competitorn/a
Meas. Tech.ChEMBL_1291902 (CHEMBL3124216)
Ki 3.0±n/a nM
Citation Estrada, AAChan, BKBaker-Glenn, CBeresford, ABurdick, DJChambers, MChen, HDominguez, SLDotson, JDrummond, JFlagella, MFuji, RGill, AHalladay, JHarris, SFHeffron, TPKleinheinz, TLee, DWLe Pichon, CELiu, XLyssikatos, JPMedhurst, ADMoffat, JGNash, KScearce-Levie, KSheng, ZShore, DGWong, SZhang, SZhang, XZhu, HSweeney, ZK Discovery of highly potent, selective, and brain-penetrant aminopyrazole leucine-rich repeat kinase 2 (LRRK2) small molecule inhibitors. J Med Chem57:921-36 (2014) 
 
Leucine-rich repeat serine/threonine-protein kinase 2
Name:Leucine-rich repeat serine/threonine-protein kinase 2
Type:Protein
Mol. Mass.:286113.20
Organism:Homo sapiens (Human)
Description:Q5S007
Residue:2527
BDBM50448125
NameBDBM50448125
Synonyms:CHEMBL3122106 | US9212186, 17
TypeSmall organic molecule
Emp. Form.C12H13F3N6O
Mol. Mass.314.2664
SMILESCNc1nc(Nc2cnn3CCOCc23)ncc1C(F)(F)F