Reaction Details
TargetMetabotropic glutamate receptor 1
LigandBDBM50448144
Substrate/Competitorn/a
Meas. Tech.ChEMBL_1292284 (CHEMBL3124715)
IC50 30500±n/a nM
Citation Zhang, LBalan, GBarreiro, GBoscoe, BPChenard, LKCianfrogna, JClaffey, MMChen, LCoffman, KJDrozda, SEDunetz, JRFonseca, KRGalatsis, PGrimwood, SLazzaro, JTMancuso, JYMiller, ELReese, MRRogers, BNSakurada, ISkaddan, MSmith, DLStepan, AFTrapa, PTuttle, JBVerhoest, PRWalker, DPWright, ASZaleska, MMZasadny, KShaffer, CL Discovery and preclinical characterization of 1-methyl-3-(4-methylpyridin-3-yl)-6-(pyridin-2-ylmethoxy)-1H-pyrazolo-[3,4-b]pyrazine (PF470): a highly potent, selective, and efficacious metabotropic glutamate receptor 5 (mGluR5) negative allosteric modulator. J Med Chem57:861-77 (2014) 
 
Metabotropic glutamate receptor 1
Name:Metabotropic glutamate receptor 1
Type:Enzyme
Mol. Mass.:132358.19
Organism:Homo sapiens (Human)
Description:Q13255
Residue:1194
BDBM50448144
NameBDBM50448144
Synonyms:CHEMBL3122212
TypeSmall organic molecule
Emp. Form.C18H16N6O
Mol. Mass.332.3592
SMILESCc1ccncc1-c1nn(C)c2nc(OCc3ccccn3)cnc12