Reaction Details
TargetProgesterone receptor
LigandBDBM50448168
Substrate/Competitorn/a
Meas. Tech.ChEMBL_1292838 (CHEMBL3122502)
Ki 27±n/a nM
Citation Carson, MWLuz, JGSuen, CMontrose, CZink, RRuan, XCheng, CCole, HAdrian, MDKohlman, DTMabry, TSnyder, NCondon, BMaletic, MClawson, DPustilnik, ACoghlan, MJ Glucocorticoid receptor modulators informed by crystallography lead to a new rationale for receptor selectivity, function, and implications for structure-based design. J Med Chem57:849-60 (2014) 
 
Progesterone receptor
Name:Progesterone receptor
Type:Protein
Mol. Mass.:98979.52
Organism:Homo sapiens (Human)
Description:P06401
Residue:933
BDBM50448168
NameBDBM50448168
Synonyms:CHEMBL3120317
TypeSmall organic molecule
Emp. Form.C25H25NO4S
Mol. Mass.435.535
SMILESCC\C(c1cccc(NS(C)(=O)=O)c1)=C1/c2ccccc2OCc2cccc(OC)c12