Reaction Details
TargetAndrogen receptor
LigandBDBM50448167
Substrate/Competitorn/a
Meas. Tech.ChEMBL_1292839 (CHEMBL3122503)
Ki 9.7±n/a nM
Citation Carson, MWLuz, JGSuen, CMontrose, CZink, RRuan, XCheng, CCole, HAdrian, MDKohlman, DTMabry, TSnyder, NCondon, BMaletic, MClawson, DPustilnik, ACoghlan, MJ Glucocorticoid receptor modulators informed by crystallography lead to a new rationale for receptor selectivity, function, and implications for structure-based design. J Med Chem57:849-60 (2014) 
 
Androgen receptor
Name:Androgen receptor
Type:Receptor
Mol. Mass.:99185.27
Organism:Homo sapiens (Human)
Description:CHO cells were stably transfected with human AR gene.
Residue:920
BDBM50448167
NameBDBM50448167
Synonyms:CHEMBL3120318
TypeSmall organic molecule
Emp. Form.C24H23NO3S
Mol. Mass.405.509
SMILESCC\C(c1cccc(NS(C)(=O)=O)c1)=C1\c2ccccc2COc2ccccc12