Reaction Details
TargetUrease
LigandBDBM50448174
Substrate/Competitorn/a
Meas. Tech.ChEMBL_1293002 (CHEMBL3122981)
Ki 12100±n/a nM
Citation Khan, KMNaz, FTaha, MKhan, APerveen, SChoudhary, MIVoelter, W Synthesis and in vitro urease inhibitory activity of N,N'-disubstituted thioureas. Eur J Med Chem74:314-23 (2014) 
 
Urease
Name:Urease
Type:Enzyme
Mol. Mass.:90746.20
Organism:Canavalia ensiformis (Jack bean) (Horse bean)
Description:P07374
Residue:840
BDBM50448174
NameBDBM50448174
Synonyms:CHEMBL3120548
TypeSmall organic molecule
Emp. Form.C14H13ClN2S
Mol. Mass.276.784
SMILESCc1ccc(NC(=S)Nc2cccc(Cl)c2)cc1