Reaction Details
TargetUrease
LigandBDBM50448175
Substrate/Competitorn/a
Meas. Tech.ChEMBL_1293003 (CHEMBL3122982)
Ki 8600±n/a nM
Citation Khan, KMNaz, FTaha, MKhan, APerveen, SChoudhary, MIVoelter, W Synthesis and in vitro urease inhibitory activity of N,N'-disubstituted thioureas. Eur J Med Chem74:314-23 (2014) 
 
Urease
Name:Urease
Type:Enzyme
Mol. Mass.:90746.20
Organism:Canavalia ensiformis (Jack bean) (Horse bean)
Description:P07374
Residue:840
BDBM50448175
NameBDBM50448175
Synonyms:CHEMBL3120552
TypeSmall organic molecule
Emp. Form.C12H11N3S
Mol. Mass.229.301
SMILESS=C(Nc1ccccc1)Nc1cccnc1