Reaction Details
TargetAcetylcholinesterase
LigandBDBM50448219
Substrate/Competitorn/a
Meas. Tech.ChEMBL_1293181 (CHEMBL3123368)
IC50 103±n/a nM
Citation Oset-Gasque, MJGonzález, MPPérez-Peña, JGarcía-Font, NRomero, Adel Pino, JRamos, EHadjipavlou-Litina, DSoriano, EChioua, MSamadi, ARaghuvanshi, DSSingh, KNMarco-Contelles, J Toxicological and pharmacological evaluation, antioxidant, ADMET and molecular modeling of selected racemic chromenotacrines {11-amino-12-aryl-8,9,10,12-tetrahydro-7H-chromeno[2,3-b]quinolin-3-ols} for the potential prevention and treatment of Alzheimer's disease. Eur J Med Chem74:491-501 (2014) 
 
Acetylcholinesterase
Name:Acetylcholinesterase
Type:Enzyme
Mol. Mass.:71812.79
Organism:Electrophorus electricus (Electric eel)
Description:n/a
Residue:633
BDBM50448219
NameBDBM50448219
Synonyms:CHEMBL3120712
TypeSmall organic molecule
Emp. Form.C22H19FN2O2
Mol. Mass.362.3969
SMILESNc1c2CCCCc2nc2Oc3cc(O)ccc3C(c3ccc(F)cc3)c12