Reaction Details
TargetCysteine proteinase falcipain 3
LigandBDBM50448255
Substrate/Competitorn/a
Meas. Tech.ChEMBL_1293361 (CHEMBL3122304)
IC50 47230±n/a nM
Citation Weldon, DJShah, FChittiboyina, AGSheri, AChada, RRGut, JRosenthal, PJShivakumar, DSherman, WDesai, PJung, JCAvery, MA Synthesis, biological evaluation, hydration site thermodynamics, and chemical reactivity analysis ofa-keto substituted peptidomimetics for the inhibition of Plasmodium falciparum. Bioorg Med Chem Lett24:1274-9 (2014) 
 
Cysteine proteinase falcipain 3
Name:Cysteine proteinase falcipain 3
Synonyms:Cysteine protease falcipain-3
Type:Protein
Mol. Mass.:56666.98
Organism:Plasmodium falciparum
Description:Q9NAW4
Residue:492
BDBM50448255
NameBDBM50448255
Synonyms:CHEMBL3120840
TypeSmall organic molecule
Emp. Form.C26H30N2O6
Mol. Mass.466.5262
SMILESOCC(=O)[C@H](CCc1ccccc1)NC(=O)C1(CCC(=O)CC1)NC(=O)OCc1ccccc1