Reaction Details
TargetCysteine proteinase falcipain 3
LigandBDBM50448258
Substrate/Competitorn/a
Meas. Tech.ChEMBL_1293361 (CHEMBL3122304)
IC50 23900±n/a nM
Citation Weldon, DJShah, FChittiboyina, AGSheri, AChada, RRGut, JRosenthal, PJShivakumar, DSherman, WDesai, PJung, JCAvery, MA Synthesis, biological evaluation, hydration site thermodynamics, and chemical reactivity analysis ofa-keto substituted peptidomimetics for the inhibition of Plasmodium falciparum. Bioorg Med Chem Lett24:1274-9 (2014) 
 
Cysteine proteinase falcipain 3
Name:Cysteine proteinase falcipain 3
Synonyms:Cysteine protease falcipain-3
Type:Protein
Mol. Mass.:56666.98
Organism:Plasmodium falciparum
Description:Q9NAW4
Residue:492
BDBM50448258
NameBDBM50448258
Synonyms:CHEMBL3120837
TypeSmall organic molecule
Emp. Form.C25H30N2O5
Mol. Mass.438.5161
SMILESOCC(=O)[C@H](CCc1ccccc1)NC(=O)[C@@H]1CCC[C@@H]1NC(=O)OCc1ccccc1