Reaction Details
TargetCysteine proteinase falcipain 2a
LigandBDBM50448253
Substrate/Competitorn/a
Meas. Tech.ChEMBL_1293362 (CHEMBL3122305)
IC50 3250±n/a nM
Citation Weldon, DJShah, FChittiboyina, AGSheri, AChada, RRGut, JRosenthal, PJShivakumar, DSherman, WDesai, PJung, JCAvery, MA Synthesis, biological evaluation, hydration site thermodynamics, and chemical reactivity analysis ofa-keto substituted peptidomimetics for the inhibition of Plasmodium falciparum. Bioorg Med Chem Lett24:1274-9 (2014) 
 
Cysteine proteinase falcipain 2a
Name:Cysteine proteinase falcipain 2a
Synonyms:Cysteine protease falcipain-2
Type:Protein
Mol. Mass.:55996.21
Organism:Plasmodium falciparum
Description:Q9NBD4
Residue:484
BDBM50448253
NameBDBM50448253
Synonyms:CHEMBL3120842
TypeSmall organic molecule
Emp. Form.C25H30N2O5S
Mol. Mass.470.581
SMILESOCC(=O)[C@H](CCc1ccccc1)NC(=O)C1(CCSCC1)NC(=O)OCc1ccccc1