Reaction Details
TargetDihydrofolate reductase
LigandBDBM50448341
Substrate/Competitorn/a
Meas. Tech.ChEMBL_1294109 (CHEMBL3122687)
Ki 8000±n/a nM
Citation Piras, SCarta, ABriguglio, ICorona, PPaglietti, GLuciani, RCosti, MPFerrari, S 2-[N-Alkyl(R-phenyl)-aminomethyl]-3-phenyl-7-trifluoromethylquinoxalines as anticancer agents inhibitors of folate enzymes. Eur J Med Chem75:169-83 (2014) 
 
Dihydrofolate reductase
Name:Dihydrofolate reductase
Type:Enzyme
Mol. Mass.:21453.99
Organism:Homo sapiens (Human)
Description:Recombinant human DHFR.
Residue:187
BDBM50448341
NameBDBM50448341
Synonyms:CHEMBL3121453
TypeSmall organic molecule
Emp. Form.C25H16F5N3
Mol. Mass.453.4067
SMILESFc1ccc(cc1F)N(CC#C)Cc1nc2cc(ccc2nc1-c1ccccc1)C(F)(F)F