Reaction Details
TargetDihydrofolate reductase
LigandBDBM50448343
Substrate/Competitorn/a
Meas. Tech.ChEMBL_1294109 (CHEMBL3122687)
Ki 6000±n/a nM
Citation Piras, SCarta, ABriguglio, ICorona, PPaglietti, GLuciani, RCosti, MPFerrari, S 2-[N-Alkyl(R-phenyl)-aminomethyl]-3-phenyl-7-trifluoromethylquinoxalines as anticancer agents inhibitors of folate enzymes. Eur J Med Chem75:169-83 (2014) 
 
Dihydrofolate reductase
Name:Dihydrofolate reductase
Type:Enzyme
Mol. Mass.:21453.99
Organism:Homo sapiens (Human)
Description:Recombinant human DHFR.
Residue:187
BDBM50448343
NameBDBM50448343
Synonyms:CHEMBL3121447
TypeSmall organic molecule
Emp. Form.C26H20F3N3
Mol. Mass.431.4523
SMILESCc1ccc(cc1)N(CC#C)Cc1nc2cc(ccc2nc1-c1ccccc1)C(F)(F)F