Reaction Details
TargetDihydrofolate reductase
LigandBDBM50448360
Substrate/Competitorn/a
Meas. Tech.ChEMBL_1294109 (CHEMBL3122687)
Ki 4000±n/a nM
Citation Piras, SCarta, ABriguglio, ICorona, PPaglietti, GLuciani, RCosti, MPFerrari, S 2-[N-Alkyl(R-phenyl)-aminomethyl]-3-phenyl-7-trifluoromethylquinoxalines as anticancer agents inhibitors of folate enzymes. Eur J Med Chem75:169-83 (2014) 
 
Dihydrofolate reductase
Name:Dihydrofolate reductase
Type:Enzyme
Mol. Mass.:21453.99
Organism:Homo sapiens (Human)
Description:Recombinant human DHFR.
Residue:187
BDBM50448360
NameBDBM50448360
Synonyms:CHEMBL3121467
TypeSmall organic molecule
Emp. Form.C25H22F3N3
Mol. Mass.421.4575
SMILESCCN(Cc1nc2cc(ccc2nc1-c1ccccc1)C(F)(F)F)c1ccc(C)cc1