Reaction Details
TargetAcetylcholine receptor subunit epsilon
LigandBDBM50448370
Substrate/Competitorn/a
Meas. Tech.ChEMBL_1292388 (CHEMBL3123981)
IC50 7943±n/a nM
Citation Matera, CFlammini, LQuadri, MVivo, VBallabeni, VHolzgrabe, UMohr, KDe Amici, MBarocelli, EBertoni, SDallanoce, C Bis(ammonio)alkane-type agonists of muscarinic acetylcholine receptors: synthesis, in vitro functional characterization, and in vivo evaluation of their analgesic activity. Eur J Med Chem75:222-32 (2014) 
 
Acetylcholine receptor subunit epsilon
Name:Acetylcholine receptor subunit epsilon
Type:PROTEIN
Mol. Mass.:54930.09
Organism:Rattus norvegicus
Description:ChEMBL_1292388
Residue:494
BDBM50448370
NameBDBM50448370
Synonyms:CHEMBL3120178
TypeSmall organic molecule
Emp. Form.C33H46N4O4
Mol. Mass.562.7416
SMILESC[N+](C)(CCCCCCC[N+](C)(C)CC#CCOC1=NOCC1)CCCN1C(=O)c2cccc3cccc(C1=O)c23