Reaction Details
TargetMuscarinic acetylcholine receptor M2
LigandBDBM39342
Substrate/Competitorn/a
Meas. Tech.ChEMBL_1292393 (CHEMBL3123986)
EC50 1413±n/a nM
Citation Matera, CFlammini, LQuadri, MVivo, VBallabeni, VHolzgrabe, UMohr, KDe Amici, MBarocelli, EBertoni, SDallanoce, C Bis(ammonio)alkane-type agonists of muscarinic acetylcholine receptors: synthesis, in vitro functional characterization, and in vivo evaluation of their analgesic activity. Eur J Med Chem75:222-32 (2014) 
 
Muscarinic acetylcholine receptor M2
Name:Muscarinic acetylcholine receptor M2
Type:Enzyme Catalytic Domain
Mol. Mass.:51688.65
Organism:GUINEA PIG
Description:Cholinergic, muscarinic 0 GUINEA PIG::P06199
Residue:466
BDBM39342
NameBDBM39342
Synonyms:2-aminocarbonyloxypropyl(trimethyl)azanium;chloride 2-carbamoyloxypropyl(trimethyl)azanium;chloride BETHANECHOL CHLORIDE Hermes, Myo Myotonine cid_11548
TypeSmall organic molecule
Emp. Form.C7H17N2O2
Mol. Mass.161.2215
SMILESCC(C[N+](C)(C)C)OC(N)=O