Reaction Details
TargetXanthine dehydrogenase/oxidase
LigandBDBM50448381
Substrate/Competitorn/a
Meas. Tech.ChEMBL_1292552 (CHEMBL3124255)
IC50 2790±n/a nM
Citation Shi, DHHuang, WLi, CLiu, YWWang, SF Design, synthesis and molecular modeling of aloe-emodin derivatives as potent xanthine oxidase inhibitors. Eur J Med Chem75:289-96 (2014) 
 
Xanthine dehydrogenase/oxidase
Name:Xanthine dehydrogenase/oxidase
Type:Protein
Mol. Mass.:146809.00
Organism:Bos taurus (Bovine)
Description:P80457
Residue:1332
BDBM50448381
NameBDBM50448381
Synonyms:CHEMBL2338661
TypeSmall organic molecule
Emp. Form.C15H8O5
Mol. Mass.268.221
SMILESOc1cccc2C(=O)c3cc(C=O)cc(O)c3C(=O)c12