Reaction Details
TargetCD209 antigen
LigandBDBM50448398
Substrate/Competitorn/a
Meas. Tech.ChEMBL_1292697 (CHEMBL3123564)
IC50 3890000±n/a nM
Citation Tomašic, THajšek, DŠvajger, ULuzar, JObermajer, NPetit-Haertlein, IFieschi, FAnderluh, M Monovalent mannose-based DC-SIGN antagonists: targeting the hydrophobic groove of the receptor. Eur J Med Chem75:308-26 (2014) 
 
CD209 antigen
Name:CD209 antigen
Type:PROTEIN
Mol. Mass.:45768.84
Organism:Homo sapiens (Human)
Description:ChEMBL_104194
Residue:404
BDBM50448398
NameBDBM50448398
Synonyms:CHEMBL3121703
TypeSmall organic molecule
Emp. Form.C25H32N2O10
Mol. Mass.520.529
SMILESCOc1ccc(cc1)C(=O)NCC(CNC(=O)c1ccc(OC)cc1)O[C@H]1O[C@H](CO)[C@@H](O)[C@H](O)[C@@H]1O