Reaction Details
TargetCD209 antigen
LigandBDBM50448400
Substrate/Competitorn/a
Meas. Tech.ChEMBL_1292697 (CHEMBL3123564)
IC50 8790000±n/a nM
Citation Tomašic, THajšek, DŠvajger, ULuzar, JObermajer, NPetit-Haertlein, IFieschi, FAnderluh, M Monovalent mannose-based DC-SIGN antagonists: targeting the hydrophobic groove of the receptor. Eur J Med Chem75:308-26 (2014) 
 
CD209 antigen
Name:CD209 antigen
Type:PROTEIN
Mol. Mass.:45768.84
Organism:Homo sapiens (Human)
Description:ChEMBL_104194
Residue:404
BDBM50448400
NameBDBM50448400
Synonyms:CHEMBL3121701
TypeSmall organic molecule
Emp. Form.C23H28N2O8
Mol. Mass.460.477
SMILESOC[C@H]1O[C@H](OC(CNC(=O)c2ccccc2)CNC(=O)c2ccccc2)[C@@H](O)[C@@H](O)[C@@H]1O