Reaction Details
TargetFatty acid-binding protein, heart
LigandBDBM50448435
Substrate/Competitorn/a
Meas. Tech.ChEMBL_1293417 (CHEMBL3122516)
Kd 0.200000±n/a nM
Citation Tan, MCMatsuoka, SAno, HIshida, HHirose, MSato, FSugiyama, SMurata, M Interaction kinetics of liposome-incorporated unsaturated fatty acids with fatty acid-binding protein 3 by surface plasmon resonance. Bioorg Med Chem22:1804-8 (2014) 
 
Fatty acid-binding protein, heart
Name:Fatty acid-binding protein, heart
Type:PROTEIN
Mol. Mass.:14858.36
Organism:Homo sapiens (Human)
Description:ChEMBL_1463784
Residue:133
BDBM50448435
NameBDBM50448435
Synonyms:CHEMBL3122088
TypeSmall organic molecule
Emp. Form.C18H31O2
Mol. Mass.279.4381
SMILESCCCCC\C=C/C\C=C/CCCCCCCC([O-])=O